profundity-n
type: LexicalEntry
canonical form: profundity
sense: 05102125-n
part of speech: noun
sense: 05142145-n
sense: 05621745-n
sense: 05934990-n

profoundness-n
type: LexicalEntry
canonical form: profoundness
sense: 05102125-n
part of speech: noun
sense: 05142145-n
sense: 05621745-n
sense: 05934990-n

05102125-n
type: LexicalConcept
in scheme: en-word.net
definition: intellectual depth, penetrating knowledge, keen insight, etc.
example: the depth of my feeling
example: the profoundness of the silence
ili: i63766
lexfile: noun.attribute
part of speech: noun
hypernym: 05101987-n

deepness-n
type: LexicalEntry
canonical form: deepness
sense: 05142145-n
part of speech: noun
sense: 05621745-n

05142145-n
type: LexicalConcept
in scheme: en-word.net
definition: the quality of being physically deep
example: the profundity of the mine was almost a mile
ili: i63972
lexfile: noun.attribute
part of speech: noun
hypernym: 05141812-n

astuteness-n
type: LexicalEntry
canonical form: astuteness
sense: 05621745-n
part of speech: noun

depth-n
type: LexicalEntry
canonical form: depth
sense: 05621745-n
part of speech: noun

05621745-n
type: LexicalConcept
in scheme: en-word.net
definition: the intellectual ability to penetrate deeply into ideas
ili: i66412
lexfile: noun.cognition
part of speech: noun
hypernym: 05624890-n

reconditeness-n
type: LexicalEntry
canonical form: reconditeness
sense: 05934990-n
part of speech: noun

abstruseness-n
type: LexicalEntry
canonical form: abstruseness
sense: 05934990-n
part of speech: noun

abstrusity-n
type: LexicalEntry
canonical form: abstrusity
sense: 05934990-n
part of speech: noun

05934990-n
type: LexicalConcept
in scheme: en-word.net
definition: wisdom that is recondite and abstruse and profound
example: the anthropologist was impressed by the reconditeness of the native proverbs
ili: i67976
lexfile: noun.cognition
part of speech: noun
hypernym: 05934868-n