praise-v
type: LexicalEntry
canonical form: praise
sense: 00858506-v
part of speech: verb

00858506-v
type: LexicalConcept
in scheme: en-word.net
definition: express approval of
example: The parents praised their children for their academic performance
ili: i25913
lexfile: verb.communication
part of speech: verb
hypernym: 00683348-v

praise-n
type: LexicalEntry
canonical form: praise
sense: 06705943-n
part of speech: noun
sense: 06706247-n

congratulations-n
type: LexicalEntry
canonical form: congratulations
sense: 06705943-n
part of speech: noun

kudos-n
type: LexicalEntry
canonical form: kudos
sense: 06705943-n
part of speech: noun

extolment-n
type: LexicalEntry
canonical form: extolment
sense: 06705943-n
part of speech: noun

06705943-n
type: LexicalConcept
in scheme: en-word.net
definition: an expression of approval and commendation
example: he always appreciated praise for his work
ili: i71660
lexfile: noun.communication
part of speech: noun
hypernym: 06699481-n

06706247-n
type: LexicalConcept
in scheme: en-word.net
definition: offering words of homage as an act of worship
example: they sang a hymn of praise to God
ili: i71661
lexfile: noun.communication
part of speech: noun
hypernym: 01030597-n