pony-n
type: LexicalEntry
canonical form: pony
sense: 02382987-n
part of speech: noun
sense: 02385089-n
sense: 02387750-n
sense: 04213292-n
sense: 06358595-n

02382987-n
type: LexicalConcept
in scheme: en-word.net
definition: a range horse of the western United States
ili: i48091
lexfile: noun.animal
part of speech: noun
hypernym: 02377103-n

02385089-n
type: LexicalConcept
in scheme: en-word.net
definition: any of various breeds of small gentle horses usually less than five feet high at the shoulder
ili: i48108
lexfile: noun.animal
part of speech: noun
hypernym: 02377103-n

02387750-n
type: LexicalConcept
in scheme: en-word.net
definition: an informal term for a racehorse
example: he liked to bet on the ponies
ili: i48128
lexfile: noun.animal
part of speech: noun
hypernym: 02385600-n

shot glass-n
type: LexicalEntry
canonical form: shot glass
sense: 04213292-n
part of speech: noun

jigger-n
type: LexicalEntry
canonical form: jigger
sense: 04213292-n
part of speech: noun

04213292-n
type: LexicalConcept
in scheme: en-word.net
definition: a small glass adequate to hold a single swallow of whiskey
ili: i58855
lexfile: noun.artifact
part of speech: noun
hypernym: 03443167-n

trot-n
type: LexicalEntry
canonical form: trot
sense: 06358595-n
part of speech: noun

crib-n
type: LexicalEntry
canonical form: crib
sense: 06358595-n
part of speech: noun

06358595-n
type: LexicalConcept
in scheme: en-word.net
definition: a literal translation used in studying a foreign language (often used illicitly)
ili: i69837
lexfile: noun.communication
part of speech: noun
hypernym: 06548380-n