poetry-n
type: LexicalEntry
canonical form: poetry
sense: 07107220-n
part of speech: noun
sense: 07107939-n

poesy-n
type: LexicalEntry
canonical form: poesy
sense: 07107220-n
part of speech: noun

verse-n
type: LexicalEntry
canonical form: verse
sense: 07107220-n
part of speech: noun

07107220-n
type: LexicalConcept
in scheme: en-word.net
definition: literature in metrical form
ili: i73924
lexfile: noun.communication
part of speech: noun
hypernym: 07106786-n

07107939-n
type: LexicalConcept
in scheme: en-word.net
definition: any communication resembling poetry in beauty or the evocation of feeling
ili: i73926
lexfile: noun.communication
part of speech: noun
hypernym: 07080699-n