botany-n
type: LexicalEntry
canonical form: botany
sense: 06076105-n
part of speech: noun

phytology-n
type: LexicalEntry
canonical form: phytology
sense: 06076105-n
part of speech: noun

06076105-n
type: LexicalConcept
in scheme: en-word.net
definition: the branch of biology that studies plants
ili: i68597
lexfile: noun.cognition
part of speech: noun
hypernym: 06047178-n