physical phenomenon-n
type: LexicalEntry
canonical form: physical phenomenon
sense: 11439518-n
part of speech: noun

11439518-n
type: LexicalConcept
in scheme: en-word.net
definition: a natural phenomenon involving the physical properties of matter and energy
ili: i97597
lexfile: noun.phenomenon
part of speech: noun
hypernym: 11428673-n