phenomenon-n
type: LexicalEntry
canonical form: phenomenon
sense: 00034512-n
part of speech: noun
sense: 07438418-n

00034512-n
type: LexicalConcept
in scheme: en-word.net
definition: any state or process known through the senses rather than by intuition or reasoning
ili: i35595
lexfile: noun.Tops
part of speech: noun
hypernym: 00029976-n

07438418-n
type: LexicalConcept
in scheme: en-word.net
definition: a remarkable development
ili: i75725
lexfile: noun.event
part of speech: noun
hypernym: 07438160-n