peruse-v
type: LexicalEntry
canonical form: peruse
sense: 02157242-v
part of speech: verb

02157242-v
type: LexicalConcept
in scheme: en-word.net
definition: examine or consider with attention and in detail
example: Please peruse this report at your leisure
ili: i32518
lexfile: verb.perception
part of speech: verb
hypernym: 02135744-v