pencil-v
type: LexicalEntry
canonical form: pencil
sense: 01692499-v
part of speech: verb

01692499-v
type: LexicalConcept
in scheme: en-word.net
definition: write, draw, or trace with a pencil
example: he penciled a figure
ili: i30186
lexfile: verb.creation
part of speech: verb
entails: 01585566-v
hypernym: 01694189-v

pencil-n
type: LexicalEntry
canonical form: pencil
sense: 03914323-n
part of speech: noun
sense: 03914575-n
sense: 13885623-n
sense: 14820918-n

03914323-n
type: LexicalConcept
in scheme: en-word.net
definition: a thin cylindrical pointed writing implement; a rod of marking substance encased in wood
ili: i57109
lexfile: noun.artifact
part of speech: noun
hypernym: 04615925-n
mero part: 03980573-n
mero part: 04123606-n
mero part: 13925175-n

03914575-n
type: LexicalConcept
in scheme: en-word.net
definition: a cosmetic in a long thin stick; designed to be applied to a particular part of the face
example: an eyebrow pencil
ili: i57110
lexfile: noun.artifact
part of speech: noun
hypernym: 03117803-n

13885623-n
type: LexicalConcept
in scheme: en-word.net
definition: a figure formed by a set of straight lines or light rays meeting at a point
ili: i109777
lexfile: noun.shape
part of speech: noun
domain topic: 06100457-n
domain topic: 06014015-n
hypernym: 13885383-n

14820918-n
type: LexicalConcept
in scheme: en-word.net
definition: graphite (or a similar substance) used in such a way as to be a medium of communication
example: the words were scribbled in pencil
example: this artist's favorite medium is pencil
ili: i114792
lexfile: noun.substance
part of speech: noun
hypernym: 14820745-n