rain-n
type: LexicalEntry
canonical form: rain
sense: 05052359-n
part of speech: noun

pelting-n
type: LexicalEntry
canonical form: pelting
sense: 05052359-n
part of speech: noun

05052359-n
type: LexicalConcept
in scheme: en-word.net
definition: anything happening rapidly or in quick successive
example: a rain of bullets
example: a pelting of insults
ili: i63514
lexfile: noun.attribute
part of speech: noun
hypernym: 05051973-n