peeve-v
type: LexicalEntry
canonical form: peeve
sense: 01792751-v
part of speech: verb

01792751-v
type: LexicalConcept
in scheme: en-word.net
definition: cause to be annoyed, irritated, or resentful
ili: i30677
lexfile: verb.emotion
part of speech: verb
hypernym: 01791774-v

peeve-n
type: LexicalEntry
canonical form: peeve
sense: 07566884-n
part of speech: noun

07566884-n
type: LexicalConcept
in scheme: en-word.net
definition: an annoyed or irritated mood
ili: i76444
lexfile: noun.feeling
part of speech: noun
hypernym: 07566518-n