peaceful-a
type: LexicalEntry
canonical form: peaceful
sense: https://en-word.net/lemma/peaceful-a#01745141-a
part of speech: adjective
sense: 02523159-s

peaceable-a
type: LexicalEntry
canonical form: peaceable
sense: https://en-word.net/lemma/peaceable-a#01745141-a
part of speech: adjective

https://en-word.net/synset/01745141-a
type: LexicalConcept
in scheme: en-word.net
definition: not disturbed by strife or turmoil or war
example: a peaceful nation
example: peaceful times
example: a far from peaceful Christmas
example: peaceful sleep
ili: i9560
lexfile: adj.all
part of speech: adjective
also: https://en-word.net/synset/01249453-a
also: https://en-word.net/synset/02522980-a
also: https://en-word.net/synset/01929162-a
also: https://en-word.net/synset/00085425-a
also: https://en-word.net/synset/00303560-a
similar: 01745519-s
similar: 01745657-s
similar: 01745812-s
similar: 01745918-s
similar: 01746202-s
similar: 01746368-s

passive-a
type: LexicalEntry
canonical form: passive
sense: 02523159-s
part of speech: adjective

02523159-s
type: LexicalConcept
in scheme: en-word.net
definition: peacefully resistant in response to injustice
example: passive resistance
ili: i13937
lexfile: adj.all
part of speech: adjective satellite
similar: https://en-word.net/synset/02522980-a