passive-a
type: LexicalEntry
canonical form: passive
sense: https://en-word.net/lemma/passive-a#00039705-a
part of speech: adjective
sense: https://en-word.net/lemma/passive-a#00042449-a
sense: 02523159-s

inactive-a
type: LexicalEntry
canonical form: inactive
sense: https://en-word.net/lemma/inactive-a#00039705-a
part of speech: adjective

https://en-word.net/synset/00039705-a
type: LexicalConcept
in scheme: en-word.net
definition: lacking in energy or will
example: Much benevolence of the passive order may be traced to a disinclination to inflict pain upon oneself
  source: George Meredith
ili: i200
lexfile: adj.all
part of speech: adjective
attribute: 04643754-n
similar: 00040060-s
similar: 00040189-s
similar: 00040305-s

https://en-word.net/synset/00042449-a
type: LexicalConcept
in scheme: en-word.net
definition: expressing that the subject of the sentence is the patient of the action denoted by the verb
example: academics seem to favor passive sentences
ili: i214
lexfile: adj.all
part of speech: adjective
domain topic: 06184139-n

peaceful-a
type: LexicalEntry
canonical form: peaceful
sense: 02523159-s
part of speech: adjective

02523159-s
type: LexicalConcept
in scheme: en-word.net
definition: peacefully resistant in response to injustice
example: passive resistance
ili: i13937
lexfile: adj.all
part of speech: adjective satellite
similar: https://en-word.net/synset/02522980-a

passive voice-n
type: LexicalEntry
canonical form: passive voice
sense: 13825643-n
part of speech: noun

passive-n
type: LexicalEntry
canonical form: passive
sense: 13825643-n
part of speech: noun

13825643-n
type: LexicalConcept
in scheme: en-word.net
definition: the voice used to indicate that the grammatical subject of the verb is the recipient (not the source) of the action denoted by the verb
example: ‘The ball was thrown by the boy’ uses the passive voice
example: ‘The ball was thrown’ is an abbreviated passive
ili: i109444
lexfile: noun.relation
part of speech: noun
hypernym: 13825132-n