passenger-n
type: LexicalEntry
canonical form: passenger
sense: 10423621-n
part of speech: noun

rider-n
type: LexicalEntry
canonical form: rider
sense: 10423621-n
part of speech: noun

10423621-n
type: LexicalConcept
in scheme: en-word.net
definition: a traveler riding in a vehicle (a boat or bus or car or plane or train etc.) who is not operating it
ili: i91884
lexfile: noun.person
part of speech: noun
domain topic: 02861626-n
domain topic: 02927500-n
domain topic: 02961779-n
domain topic: 02694015-n
domain topic: 04475240-n
hypernym: 09652940-n