participant-n
type: LexicalEntry
canonical form: participant
sense: 10421528-n
part of speech: noun
sense: 10459618-n

player-n
type: LexicalEntry
canonical form: player
sense: 10421528-n
part of speech: noun
sense: 10459618-n

10421528-n
type: LexicalConcept
in scheme: en-word.net
definition: someone who takes part in an activity
example: he was a major player in setting up the corporation
ili: i91872
lexfile: noun.person
part of speech: noun
hypernym: 09836176-n

10459618-n
type: LexicalConcept
in scheme: en-word.net
definition: a person who participates in or is skilled at some game
ili: i92069
lexfile: noun.person
part of speech: noun
hypernym: 09636221-n