outshine-v
type: LexicalEntry
canonical form: outshine
sense: 01109665-v
part of speech: verb
sense: 02769124-v

01109665-v
type: LexicalConcept
in scheme: en-word.net
definition: attract more attention and praise than others
example: This film outshone all the others in quality
ili: i27130
lexfile: verb.competition
part of speech: verb
hypernym: 01108050-v

02769124-v
type: LexicalConcept
in scheme: en-word.net
definition: shine brighter than
example: What star outshines the sun?
ili: i35496
lexfile: verb.weather
part of speech: verb
hypernym: 02769698-v