outbid-v
type: LexicalEntry
canonical form: outbid
sense: 02304762-v
part of speech: verb
sense: 02305961-v

02304762-v
type: LexicalConcept
in scheme: en-word.net
definition: bid higher than others
ili: i33229
lexfile: verb.possession
part of speech: verb
domain topic: 00093186-n
hypernym: 02303593-v

02305961-v
type: LexicalConcept
in scheme: en-word.net
definition: bid over an opponent's bid when one's partner has not bid or doubled
ili: i33236
lexfile: verb.possession
part of speech: verb
domain topic: 00491580-n
hypernym: 02305021-v