orthopedics-n
type: LexicalEntry
canonical form: orthopedics
sense: 06073656-n
part of speech: noun

orthopaedics-n
type: LexicalEntry
canonical form: orthopaedics
sense: 06073656-n
part of speech: noun

06073656-n
type: LexicalConcept
in scheme: en-word.net
definition: the branch of medical science concerned with disorders or deformities of the spine and joints
ili: i68584
lexfile: noun.cognition
part of speech: noun
hypernym: 06055093-n