electric organ-n
type: LexicalEntry
canonical form: electric organ
sense: 03278462-n
part of speech: noun

electronic organ-n
type: LexicalEntry
canonical form: electronic organ
sense: 03278462-n
part of speech: noun

Hammond organ-n
type: LexicalEntry
canonical form: Hammond organ
sense: 03278462-n
part of speech: noun

organ-n
type: LexicalEntry
canonical form: organ
sense: 03278462-n
part of speech: noun
sense: 03499638-n
sense: 03859585-n
sense: 05305022-n
sense: 06607260-n
sense: 08366277-n

03278462-n
type: LexicalConcept
in scheme: en-word.net
definition: (music) an electronic simulation of a pipe organ
ili: i53350
lexfile: noun.artifact
part of speech: noun
domain topic: 07034009-n
hypernym: 03284064-n

harmonium-n
type: LexicalEntry
canonical form: harmonium
sense: 03499638-n
part of speech: noun

reed organ-n
type: LexicalEntry
canonical form: reed organ
sense: 03499638-n
part of speech: noun

03499638-n
type: LexicalConcept
in scheme: en-word.net
definition: a free-reeded instrument with a piano keyboard in which air is forced through the reeds by bellows
ili: i54656
lexfile: noun.artifact
part of speech: noun
hypernym: 03579967-n

pipe organ-n
type: LexicalEntry
canonical form: pipe organ
sense: 03859585-n
part of speech: noun

03859585-n
type: LexicalConcept
in scheme: en-word.net
definition: wind instrument whose sound is produced by means of pipes arranged in sets supplied with air from a bellows and controlled from a large complex musical keyboard
ili: i56771
lexfile: noun.artifact
part of speech: noun
hypernym: 03619741-n
hypernym: 04594218-n
mero part: 03619216-n
mero part: 03860335-n
mero part: 03909502-n
mero part: 03935052-n
mero part: 04334462-n

05305022-n
type: LexicalConcept
in scheme: en-word.net
definition: a fully differentiated structural and functional unit in an animal that is specialized for some particular function
ili: i64800
lexfile: noun.body
part of speech: noun
hypernym: 05227735-n
mero part: 05500955-n

06607260-n
type: LexicalConcept
in scheme: en-word.net
definition: a periodical that is published by a special interest group
example: the organ of the communist party
ili: i71117
lexfile: noun.communication
part of speech: noun
hypernym: 06605500-n

08366277-n
type: LexicalConcept
in scheme: en-word.net
definition: a government agency or instrument devoted to the performance of some specific function
example: The Census Bureau is an organ of the Commerce Department
ili: i80985
lexfile: noun.group
part of speech: noun
hypernym: 08354251-n