orally-r
type: LexicalEntry
canonical form: orally
sense: 00157619-r
part of speech: adverb
sense: 00157777-r

by word of mouth-r
type: LexicalEntry
canonical form: by word of mouth
sense: 00157619-r
part of speech: adverb

00157619-r
type: LexicalConcept
in scheme: en-word.net
definition: by spoken rather than written means
example: these stories were transmitted by word of mouth
ili: i19198
lexfile: adv.all
part of speech: adverb

00157777-r
type: LexicalConcept
in scheme: en-word.net
definition: (of drugs) through the mouth rather than through injection; by mouth
example: he was administered the drug orally
ili: i19199
lexfile: adv.all
part of speech: adverb
domain topic: 03252323-n