oral-a
type: LexicalEntry
canonical form: oral
sense: https://en-word.net/lemma/oral-a#00111063-a
part of speech: adjective
sense: https://en-word.net/lemma/oral-a#01669663-a
sense: 02291903-s
sense: https://en-word.net/lemma/oral-a#02782296-a

https://en-word.net/synset/00111063-a
type: LexicalConcept
in scheme: en-word.net
definition: a stage in psychosexual development when the child's interest is concentrated in the mouth; fixation at this stage is said to result in dependence, selfishness, and aggression
ili: i586
lexfile: adj.all
part of speech: adjective
domain topic: 00705558-n

buccal-a
type: LexicalEntry
canonical form: buccal
sense: https://en-word.net/lemma/buccal-a#01669663-a
part of speech: adjective

https://en-word.net/synset/01669663-a
type: LexicalConcept
in scheme: en-word.net
definition: of or involving the mouth or mouth region or the surface on which the mouth is located
example: the oral cavity
example: the oral mucous membrane
example: the oral surface of a starfish
example: a buccal gland
ili: i9134
lexfile: adj.all
part of speech: adjective
domain topic: 06067070-n

unwritten-a
type: LexicalEntry
canonical form: unwritten
sense: 02291903-s
part of speech: adjective

02291903-s
type: LexicalConcept
in scheme: en-word.net
definition: using speech rather than writing
example: an oral tradition
example: an oral agreement
ili: i12639
lexfile: adj.all
part of speech: adjective satellite
similar: https://en-word.net/synset/02291437-a

https://en-word.net/synset/02782296-a
type: LexicalConcept
in scheme: en-word.net
definition: of or relating to or affecting or for use in the mouth
example: oral hygiene
example: an oral thermometer
example: an oral vaccine
ili: i15655
lexfile: adj.pert
part of speech: adjective

oral-n
type: LexicalEntry
canonical form: oral
sense: 07213506-n
part of speech: noun

oral exam-n
type: LexicalEntry
canonical form: oral exam
sense: 07213506-n
part of speech: noun

oral examination-n
type: LexicalEntry
canonical form: oral examination
sense: 07213506-n
part of speech: noun

viva voce-n
type: LexicalEntry
canonical form: viva voce
sense: 07213506-n
part of speech: noun

viva-n
type: LexicalEntry
canonical form: viva
sense: 07213506-n
part of speech: noun

07213506-n
type: LexicalConcept
in scheme: en-word.net
definition: an examination conducted by spoken communication
ili: i74484
lexfile: noun.communication
part of speech: noun
hypernym: 07211681-n