slot-n
type: LexicalEntry
canonical form: slot
sense: 04250674-n
part of speech: noun

one-armed bandit-n
type: LexicalEntry
canonical form: one-armed bandit
sense: 04250674-n
part of speech: noun

04250674-n
type: LexicalConcept
in scheme: en-word.net
definition: a slot machine that is used for gambling
example: they spend hours and hours just playing the slots
ili: i59099
lexfile: noun.artifact
part of speech: noun
hypernym: 04251069-n