officer-v
type: LexicalEntry
canonical form: officer
sense: 00754341-v
part of speech: verb

00754341-v
type: LexicalConcept
in scheme: en-word.net
definition: direct or command as an officer
ili: i25461
lexfile: verb.communication
part of speech: verb
hypernym: 00753893-v

military officer-n
type: LexicalEntry
canonical form: military officer
sense: 10336665-n
part of speech: noun

officer-n
type: LexicalEntry
canonical form: officer
sense: 10336665-n
part of speech: noun
sense: 10391149-n
sense: 10391440-n
sense: 10468557-n

10336665-n
type: LexicalConcept
in scheme: en-word.net
definition: any person in the armed services who holds a position of authority or command
example: an officer is responsible for the lives of his men
ili: i91363
lexfile: noun.person
part of speech: noun
domain topic: 08215965-n
hypernym: 10602198-n

officeholder-n
type: LexicalEntry
canonical form: officeholder
sense: 10391149-n
part of speech: noun

10391149-n
type: LexicalConcept
in scheme: en-word.net
definition: someone who is appointed or elected to an office and who holds a position of trust
example: he is an officer of the court
example: the club elected its officers for the coming year
ili: i91704
lexfile: noun.person
part of speech: noun
hypernym: 10392072-n
hypernym: 10199809-n

ship's officer-n
type: LexicalEntry
canonical form: ship's officer
sense: 10391440-n
part of speech: noun

10391440-n
type: LexicalConcept
in scheme: en-word.net
definition: a person authorized to serve in a position of authority on a vessel
example: he is the officer in charge of the ship's engines
ili: i91705
lexfile: noun.person
part of speech: noun
hypernym: 10314263-n

police officer-n
type: LexicalEntry
canonical form: police officer
sense: 10468557-n
part of speech: noun

10468557-n
type: LexicalConcept
in scheme: en-word.net
definition: a member of a police force
example: it was an accident, officer
ili: i92109
lexfile: noun.person
part of speech: noun
hypernym: 10269156-n