liner-n
type: LexicalEntry
canonical form: liner
sense: 03678353-n
part of speech: noun

ocean liner-n
type: LexicalEntry
canonical form: ocean liner
sense: 03678353-n
part of speech: noun

03678353-n
type: LexicalConcept
in scheme: en-word.net
definition: a large commercial ship (especially one that carries passengers on a regular schedule)
ili: i55719
lexfile: noun.artifact
part of speech: noun
hypernym: 03901800-n
mero part: 02935611-n