neoconservatism-n
type: LexicalEntry
canonical form: neoconservatism
sense: 06226345-n
part of speech: noun

06226345-n
type: LexicalConcept
in scheme: en-word.net
definition: an approach to politics or theology that represents a return to a traditional point of view (in contrast to more liberal or radical schools of thought of the 1960s)
ili: i69196
lexfile: noun.cognition
part of speech: noun
hypernym: 06225913-n