naturalist-n
type: LexicalEntry
canonical form: naturalist
sense: 10366245-n
part of speech: noun
sense: 10366686-n

natural scientist-n
type: LexicalEntry
canonical form: natural scientist
sense: 10366245-n
part of speech: noun

10366245-n
type: LexicalConcept
in scheme: en-word.net
definition: a biologist knowledgeable about natural history (especially botany and zoology)
ili: i91548
lexfile: noun.person
part of speech: noun
domain topic: 06076105-n
domain topic: 06092831-n
hypernym: 09875036-n

10366686-n
type: LexicalConcept
in scheme: en-word.net
definition: an advocate of the doctrine that the world can be understood in scientific terms
ili: i91549
lexfile: noun.person
part of speech: noun
hypernym: 10443334-n