openness-n
type: LexicalEntry
canonical form: openness
sense: 04661423-n
part of speech: noun

nakedness-n
type: LexicalEntry
canonical form: nakedness
sense: 04661423-n
part of speech: noun
sense: 14479586-n
sense: 14549150-n

04661423-n
type: LexicalConcept
in scheme: en-word.net
definition: characterized by an attitude of ready accessibility (especially about one's actions or purposes); without concealment; not secretive
ili: i61524
lexfile: noun.attribute
part of speech: noun
hypernym: 04660287-n

nudity-n
type: LexicalEntry
canonical form: nudity
sense: 14479586-n
part of speech: noun

nudeness-n
type: LexicalEntry
canonical form: nudeness
sense: 14479586-n
part of speech: noun

14479586-n
type: LexicalConcept
in scheme: en-word.net
definition: the state of being without clothing or covering of any kind
ili: i112980
lexfile: noun.state
part of speech: noun
domain topic: 00845915-n
hypernym: 13943868-n

bleakness-n
type: LexicalEntry
canonical form: bleakness
sense: 14549150-n
part of speech: noun

desolation-n
type: LexicalEntry
canonical form: desolation
sense: 14549150-n
part of speech: noun

bareness-n
type: LexicalEntry
canonical form: bareness
sense: 14549150-n
part of speech: noun

14549150-n
type: LexicalConcept
in scheme: en-word.net
definition: a bleak and desolate atmosphere
example: the nakedness of the landscape
ili: i113337
lexfile: noun.state
part of speech: noun
hypernym: 14548967-n