mover-n
type: LexicalEntry
canonical form: mover
sense: 08495493-n
part of speech: noun
sense: 10355644-n
sense: 10355947-n
sense: 10504111-n

public mover-n
type: LexicalEntry
canonical form: public mover
sense: 08495493-n
part of speech: noun

moving company-n
type: LexicalEntry
canonical form: moving company
sense: 08495493-n
part of speech: noun

removal firm-n
type: LexicalEntry
canonical form: removal firm
sense: 08495493-n
part of speech: noun

removal company-n
type: LexicalEntry
canonical form: removal company
sense: 08495493-n
part of speech: noun

08495493-n
type: LexicalConcept
in scheme: en-word.net
definition: a company that moves the possessions of a family or business from one site to another
ili: i81604
lexfile: noun.group
part of speech: noun
hypernym: 08074934-n

10355644-n
type: LexicalConcept
in scheme: en-word.net
definition: someone who moves
ili: i91485
lexfile: noun.person
part of speech: noun
hypernym: 09652940-n

10355947-n
type: LexicalConcept
in scheme: en-word.net
definition: workman employed by a moving company
example: the movers were very careful with the grand piano
ili: i91486
lexfile: noun.person
part of speech: noun
hypernym: 10810861-n

proposer-n
type: LexicalEntry
canonical form: proposer
sense: 10504111-n
part of speech: noun

10504111-n
type: LexicalConcept
in scheme: en-word.net
definition: (parliamentary procedure) someone who makes a formal motion
ili: i92302
lexfile: noun.person
part of speech: noun
domain topic: 06665623-n
hypernym: 10403515-n