mourn-v
type: LexicalEntry
canonical form: mourn
sense: 01801062-v
part of speech: verb
sense: 01801215-v

01801062-v
type: LexicalConcept
in scheme: en-word.net
definition: feel sadness
example: She is mourning her dead child
ili: i30716
lexfile: verb.emotion
part of speech: verb
hypernym: 01801358-v

01801215-v
type: LexicalConcept
in scheme: en-word.net
definition: observe the customs of mourning after the death of a loved one
ili: i30717
lexfile: verb.emotion
part of speech: verb
hypernym: 02584595-v