ethics-n
type: LexicalEntry
canonical form: ethics
sense: 06169189-n
part of speech: noun

moral philosophy-n
type: LexicalEntry
canonical form: moral philosophy
sense: 06169189-n
part of speech: noun

06169189-n
type: LexicalConcept
in scheme: en-word.net
definition: the philosophical study of moral values and rules
ili: i68929
lexfile: noun.cognition
part of speech: noun
hypernym: 06168062-n