money-n
type: LexicalEntry
canonical form: money
sense: 13271441-n
part of speech: noun
sense: 13405730-n
sense: 13406050-n

13271441-n
type: LexicalConcept
in scheme: en-word.net
definition: wealth reckoned in terms of money
example: all his money is in real estate
ili: i106280
lexfile: noun.possession
part of speech: noun
hypernym: 13271297-n

13405730-n
type: LexicalConcept
in scheme: en-word.net
definition: the most common medium of exchange; functions as legal tender
example: we tried to collect the money he owed us
ili: i107057
lexfile: noun.possession
part of speech: noun
hypernym: 13394134-n

13406050-n
type: LexicalConcept
in scheme: en-word.net
definition: the official currency issued by a government or national bank
example: he changed his money into francs
ili: i107058
lexfile: noun.possession
part of speech: noun
hypernym: 13407086-n