molindone-n
type: LexicalEntry
canonical form: molindone
sense: 03786429-n
part of speech: noun

Moban-n
type: LexicalEntry
canonical form: Moban
sense: 03786429-n
part of speech: noun

03786429-n
type: LexicalConcept
in scheme: en-word.net
definition: antipsychotic drug (trade name Moban) used in the treatment of schizophrenia
ili: i56335
lexfile: noun.artifact
part of speech: noun
hypernym: 03719275-n