drizzle-v
type: LexicalEntry
canonical form: drizzle
sense: 02763433-v
part of speech: verb

mizzle-v
type: LexicalEntry
canonical form: mizzle
sense: 02763433-v
part of speech: verb

02763433-v
type: LexicalConcept
in scheme: en-word.net
definition: rain lightly
example: When it drizzles in summer, hiking can be pleasant
ili: i35468
lexfile: verb.weather
part of speech: verb
hypernym: 02762516-v

drizzle-n
type: LexicalEntry
canonical form: drizzle
sense: 11522740-n
part of speech: noun

mizzle-n
type: LexicalEntry
canonical form: mizzle
sense: 11522740-n
part of speech: noun

11522740-n
type: LexicalConcept
in scheme: en-word.net
definition: very light rain; stronger than mist but less than a shower
ili: i98040
lexfile: noun.phenomenon
part of speech: noun
hypernym: 11521799-n