microwave-n
type: LexicalEntry
canonical form: microwave
sense: 03766619-n
part of speech: noun

microwave oven-n
type: LexicalEntry
canonical form: microwave oven
sense: 03766619-n
part of speech: noun

03766619-n
type: LexicalConcept
in scheme: en-word.net
definition: kitchen appliance that cooks food by passing an electromagnetic wave through it; heat results from the absorption of energy by the water molecules in the food
ili: i56220
lexfile: noun.artifact
part of speech: noun
hypernym: 03625261-n