metric weight unit-n
type: LexicalEntry
canonical form: metric weight unit
sense: 13739260-n
part of speech: noun

weight unit-n
type: LexicalEntry
canonical form: weight unit
sense: 13739260-n
part of speech: noun

13739260-n
type: LexicalConcept
in scheme: en-word.net
definition: a decimal unit of weight based on the gram
ili: i108934
lexfile: noun.quantity
part of speech: noun
hypernym: 13630457-n
hypernym: 13625518-n