metallic-a
type: LexicalEntry
canonical form: metallic
sense: https://en-word.net/lemma/metallic-a#01531539-a
part of speech: adjective

metal-a
type: LexicalEntry
canonical form: metal
sense: https://en-word.net/lemma/metal-a#01531539-a
part of speech: adjective

https://en-word.net/synset/01531539-a
type: LexicalConcept
in scheme: en-word.net
definition: containing or made of or resembling or characteristic of a metal
example: a metallic compound
example: metallic luster
example: the strange metallic note of the meadow lark, suggesting the clash of vibrant blades
  source: Ambrose Bierce
ili: i8387
lexfile: adj.all
part of speech: adjective
similar: 01532049-s
similar: 01532158-s
similar: 01532245-s
similar: 01532358-s
similar: 01532468-s
similar: 01532582-s
similar: 01532763-s
similar: 01532849-s
similar: 01533065-s
similar: 01533172-s
similar: 01533286-s

metal-v
type: LexicalEntry
canonical form: metal
sense: 01606224-v
part of speech: verb

01606224-v
type: LexicalConcept
in scheme: en-word.net
definition: cover with metal
ili: i29763
lexfile: verb.contact
part of speech: verb
hypernym: 01266847-v

alloy-n
type: LexicalEntry
canonical form: alloy
sense: 14610949-n
part of speech: noun

metal-n
type: LexicalEntry
canonical form: metal
sense: 14610949-n
part of speech: noun
sense: 14649636-n

14610949-n
type: LexicalConcept
in scheme: en-word.net
definition: a mixture containing two or more metallic elements or metallic and nonmetallic elements usually fused together or dissolving into each other when molten
example: brass is an alloy of zinc and copper
ili: i113678
lexfile: noun.substance
part of speech: noun
hypernym: 14610438-n
mero substance: 15076272-n

metallic element-n
type: LexicalEntry
canonical form: metallic element
sense: 14649636-n
part of speech: noun

14649636-n
type: LexicalConcept
in scheme: en-word.net
definition: any of several chemical elements that are usually shiny solids that conduct heat or electricity and can be formed into sheets etc.
ili: i113883
lexfile: noun.substance
part of speech: noun
hypernym: 14647071-n