mercantilism-n
type: LexicalEntry
canonical form: mercantilism
sense: 08384266-n
part of speech: noun

mercantile system-n
type: LexicalEntry
canonical form: mercantile system
sense: 08384266-n
part of speech: noun

08384266-n
type: LexicalConcept
in scheme: en-word.net
definition: an economic system (Europe in 18th century) to increase a nation's wealth by government regulation of all of the nation's commercial interests
ili: i81081
lexfile: noun.group
part of speech: noun
domain region: 09298379-n
hypernym: 08384027-n