melodrama-n
type: LexicalEntry
canonical form: melodrama
sense: 07029762-n
part of speech: noun

07029762-n
type: LexicalConcept
in scheme: en-word.net
definition: an extravagant comedy in which action is more salient than characterization
ili: i73538
lexfile: noun.communication
part of speech: noun
hypernym: 06387777-n