melodious-a
type: LexicalEntry
canonical form: melodious
sense: https://en-word.net/lemma/melodious-a#01504792-a
part of speech: adjective
sense: https://en-word.net/lemma/melodious-a#01505874-a

melodic-a
type: LexicalEntry
canonical form: melodic
sense: https://en-word.net/lemma/melodic-a#01504792-a
part of speech: adjective

musical-a
type: LexicalEntry
canonical form: musical
sense: https://en-word.net/lemma/musical-a#01504792-a
part of speech: adjective

https://en-word.net/synset/01504792-a
type: LexicalConcept
in scheme: en-word.net
definition: containing or constituting or characterized by pleasing melody
example: the melodious song of a meadowlark
ili: i8236
lexfile: adj.all
part of speech: adjective
similar: 01505184-s
similar: 01505298-s
similar: 01505397-s
similar: 01505500-s
similar: 01505669-s

tuneful-a
type: LexicalEntry
canonical form: tuneful
sense: https://en-word.net/lemma/tuneful-a#01505874-a
part of speech: adjective

https://en-word.net/synset/01505874-a
type: LexicalConcept
in scheme: en-word.net
definition: having a musical sound; especially a pleasing tune
ili: i8243
lexfile: adj.all
part of speech: adjective