malefic-a
type: LexicalEntry
canonical form: malefic
sense: 00226107-s
part of speech: adjective

malevolent-a
type: LexicalEntry
canonical form: malevolent
sense: 00226107-s
part of speech: adjective
sense: 00227156-s

malign-a
type: LexicalEntry
canonical form: malign
sense: 00226107-s
part of speech: adjective

evil-a
type: LexicalEntry
canonical form: evil
sense: 00226107-s
part of speech: adjective

00226107-s
type: LexicalConcept
in scheme: en-word.net
definition: having or exerting a malignant influence
example: malevolent stars
example: a malefic force
ili: i1236
lexfile: adj.all
part of speech: adjective satellite
similar: https://en-word.net/synset/00225758-a

00227156-s
type: LexicalConcept
in scheme: en-word.net
definition: wishing or appearing to wish evil to others; arising from intense ill will or hatred
example: a gossipy malevolent old woman
example: failure made him malevolent toward those who were successful
ili: i1240
lexfile: adj.all
part of speech: adjective satellite
similar: https://en-word.net/synset/00226323-a