male-n
type: LexicalEntry
canonical form: male
sense: 01323721-n
part of speech: noun
sense: 09647338-n

01323721-n
type: LexicalConcept
in scheme: en-word.net
definition: an animal that produces gametes (spermatozoa) that can fertilize female gametes (ova)
ili: i42290
lexfile: noun.animal
part of speech: noun
hypernym: 00015568-n

male-a
type: LexicalEntry
canonical form: male
sense: https://en-word.net/lemma/male-a#01479992-a
part of speech: adjective
sense: 01480384-s
sense: 01486984-s

https://en-word.net/synset/01479992-a
type: LexicalConcept
in scheme: en-word.net
definition: being the sex (of plant or animal) that produces gametes (spermatozoa) that perform the fertilizing function in generation
example: a male infant
example: a male holly tree
ili: i8088
lexfile: adj.all
part of speech: adjective
also: https://en-word.net/synset/01486631-a
attribute: 05014082-n
domain topic: 06047178-n
similar: 01480384-s
similar: 01480558-s
similar: 01480698-s
similar: 01480871-s
similar: 01481018-s

01480384-s
type: LexicalConcept
in scheme: en-word.net
definition: for or pertaining to or composed of men or boys
example: the male lead
example: the male population
ili: i8089
lexfile: adj.all
part of speech: adjective satellite
similar: https://en-word.net/synset/01479992-a

manful-a
type: LexicalEntry
canonical form: manful
sense: 01486984-s
part of speech: adjective

manlike-a
type: LexicalEntry
canonical form: manlike
sense: 01486984-s
part of speech: adjective

manly-a
type: LexicalEntry
canonical form: manly
sense: 01486984-s
part of speech: adjective

virile-a
type: LexicalEntry
canonical form: virile
sense: 01486984-s
part of speech: adjective

01486984-s
type: LexicalConcept
in scheme: en-word.net
definition: characteristic of a man
example: a deep male voice
example: manly sports
ili: i8134
lexfile: adj.all
part of speech: adjective satellite
similar: https://en-word.net/synset/01486631-a

male person-n
type: LexicalEntry
canonical form: male person
sense: 09647338-n
part of speech: noun

09647338-n
type: LexicalConcept
in scheme: en-word.net
definition: a person who belongs to the sex that cannot have babies
ili: i87226
lexfile: noun.person
part of speech: noun
hypernym: 00007846-n
mero part: 05226998-n