maharaja-n
type: LexicalEntry
canonical form: maharaja
sense: 10301334-n
part of speech: noun

maharajah-n
type: LexicalEntry
canonical form: maharajah
sense: 10301334-n
part of speech: noun

10301334-n
type: LexicalConcept
in scheme: en-word.net
definition: a great raja; a Hindu prince or king in India ranking above a raja
ili: i91149
lexfile: noun.person
part of speech: noun
hypernym: 10492384-n