aloneness-n
type: LexicalEntry
canonical form: aloneness
sense: 04629772-n
part of speech: noun

loneliness-n
type: LexicalEntry
canonical form: loneliness
sense: 04629772-n
part of speech: noun
sense: 07549496-n
sense: 14438567-n

lonesomeness-n
type: LexicalEntry
canonical form: lonesomeness
sense: 04629772-n
part of speech: noun

solitariness-n
type: LexicalEntry
canonical form: solitariness
sense: 04629772-n
part of speech: noun
sense: 14438567-n

04629772-n
type: LexicalConcept
in scheme: en-word.net
definition: a disposition toward being alone
ili: i61368
lexfile: noun.attribute
part of speech: noun
hypernym: 04630969-n

forlornness-n
type: LexicalEntry
canonical form: forlornness
sense: 07549496-n
part of speech: noun

desolation-n
type: LexicalEntry
canonical form: desolation
sense: 07549496-n
part of speech: noun

07549496-n
type: LexicalConcept
in scheme: en-word.net
definition: sadness resulting from being forsaken or abandoned
ili: i76347
lexfile: noun.feeling
part of speech: noun
hypernym: 07547828-n

14438567-n
type: LexicalConcept
in scheme: en-word.net
definition: the state of being alone in solitary isolation
ili: i112759
lexfile: noun.state
part of speech: noun
hypernym: 14438119-n