litter-v
type: LexicalEntry
canonical form: litter
sense: 00058124-v
part of speech: verb
sense: 01381086-v
sense: 02741017-v

00058124-v
type: LexicalConcept
in scheme: en-word.net
definition: give birth to a litter of animals
ili: i22067
lexfile: verb.body
part of speech: verb
hypernym: 00056644-v

01381086-v
type: LexicalConcept
in scheme: en-word.net
definition: make a place messy by strewing garbage around
ili: i28601
lexfile: verb.contact
part of speech: verb
hypernym: 01380788-v

02741017-v
type: LexicalConcept
in scheme: en-word.net
definition: strew
example: Cigar butts littered the ground
ili: i35343
lexfile: verb.stative
part of speech: verb
hypernym: 01211516-v

bedding material-n
type: LexicalEntry
canonical form: bedding material
sense: 02823567-n
part of speech: noun

bedding-n
type: LexicalEntry
canonical form: bedding
sense: 02823567-n
part of speech: noun

litter-n
type: LexicalEntry
canonical form: litter
sense: 02823567-n
part of speech: noun
sense: 03683688-n
sense: 08417288-n
sense: 14882443-n

02823567-n
type: LexicalConcept
in scheme: en-word.net
definition: material used to provide a bed for animals
ili: i50641
lexfile: noun.artifact
part of speech: noun
hypernym: 14604877-n

03683688-n
type: LexicalConcept
in scheme: en-word.net
definition: conveyance consisting of a chair or bed carried on two poles by bearers
ili: i55752
lexfile: noun.artifact
part of speech: noun
hypernym: 03105141-n

08417288-n
type: LexicalConcept
in scheme: en-word.net
definition: the offspring at one birth of a multiparous mammal
ili: i81241
lexfile: noun.group
part of speech: noun
hypernym: 08010371-n

14882443-n
type: LexicalConcept
in scheme: en-word.net
definition: rubbish carelessly dropped or left about (especially in public places)
ili: i115138
lexfile: noun.substance
part of speech: noun
hypernym: 14881648-n