liner-n
type: LexicalEntry
canonical form: liner
sense: 00132428-n
part of speech: noun

line drive-n
type: LexicalEntry
canonical form: line drive
sense: 00132428-n
part of speech: noun

00132428-n
type: LexicalConcept
in scheme: en-word.net
definition: (baseball) a hit that flies straight out from the batter
example: the batter hit a liner to the shortstop
ili: i36100
lexfile: noun.act
part of speech: noun
domain topic: 00472688-n
hypernym: 00129458-n