lightning rod-n
type: LexicalEntry
canonical form: lightning rod
sense: 03673393-n
part of speech: noun
sense: 10281880-n

lightning conductor-n
type: LexicalEntry
canonical form: lightning conductor
sense: 03673393-n
part of speech: noun

03673393-n
type: LexicalConcept
in scheme: en-word.net
definition: a metallic conductor that is attached to a high point and leads to the ground; protects the building from destruction by lightning
ili: i55692
lexfile: noun.artifact
part of speech: noun
hypernym: 03093163-n

10281880-n
type: LexicalConcept
in scheme: en-word.net
definition: someone who is a frequent target of negative reactions and serves to distract attention from another
ili: i91021
lexfile: noun.person
part of speech: noun
hypernym: 09786620-n