light-a
type: LexicalEntry
canonical form: light
sense: https://en-word.net/lemma/light-a#00270855-a
part of speech: adjective
sense: 00362917-s
sense: https://en-word.net/lemma/light-a#00409737-a
sense: 00505439-s
sense: 00697019-s
sense: 00715651-s
sense: 00996467-s
sense: 01185958-s
sense: https://en-word.net/lemma/light-a#01189951-a
sense: 01191729-s
sense: https://en-word.net/lemma/light-a#01193859-a
sense: https://en-word.net/lemma/light-a#01194536-a
sense: https://en-word.net/lemma/light-a#01194991-a
sense: https://en-word.net/lemma/light-a#01195419-a
sense: 01195936-s
sense: https://en-word.net/lemma/light-a#01196589-a
sense: 01912661-s
sense: 02128704-s
sense: 02128852-s
sense: 02172875-s
sense: 02328120-s
sense: 02345399-s
sense: 02410587-s
sense: 02422984-s
sense: 02555295-s

https://en-word.net/synset/00270855-a
type: LexicalConcept
in scheme: en-word.net
definition: characterized by or emitting light
example: a room that is light when the shutters are open
example: the inside of the house was airy and light
ili: i1511
lexfile: adj.all
part of speech: adjective
attribute: 04958550-n
similar: 00271362-s
similar: 00271598-s
similar: 00271722-s
similar: 00271888-s
similar: 00272074-s
similar: 00272154-s
similar: 00272285-s
similar: 00272446-s
similar: 00272679-s
similar: 00272832-s
similar: 00272935-s
similar: 00273038-s
similar: 00273276-s
similar: 00273421-s
similar: 00273637-s
similar: 00273816-s
similar: 85737845-s

light-v
type: LexicalEntry
canonical form: light
sense: 00292635-v
part of speech: verb
sense: 00589392-v
sense: 01202519-v
sense: 01962311-v
sense: 01982714-v
sense: 02234610-v
sense: 02765572-v

illume-v
type: LexicalEntry
canonical form: illume
sense: 00292635-v
part of speech: verb

illumine-v
type: LexicalEntry
canonical form: illumine
sense: 00292635-v
part of speech: verb

light up-v
type: LexicalEntry
canonical form: light up
sense: 00292635-v
part of speech: verb
sense: 01202519-v

illuminate-v
type: LexicalEntry
canonical form: illuminate
sense: 00292635-v
part of speech: verb

00292635-v
type: LexicalConcept
in scheme: en-word.net
definition: introduce light into
example: This lamp lightens the room a bit
ili: i23187
lexfile: verb.change
part of speech: verb
hypernym: 00281690-v

easy-a
type: LexicalEntry
canonical form: easy
sense: 00362917-s
part of speech: adjective

loose-a
type: LexicalEntry
canonical form: loose
sense: 00362917-s
part of speech: adjective

promiscuous-a
type: LexicalEntry
canonical form: promiscuous
sense: 00362917-s
part of speech: adjective

sluttish-a
type: LexicalEntry
canonical form: sluttish
sense: 00362917-s
part of speech: adjective

wanton-a
type: LexicalEntry
canonical form: wanton
sense: 00362917-s
part of speech: adjective

00362917-s
type: LexicalConcept
in scheme: en-word.net
definition: casual and unrestrained in sexual behavior
example: her easy virtue
example: he was told to avoid loose (or light) women
example: wanton behavior
ili: i2007
lexfile: adj.all
part of speech: adjective satellite
domain topic: 00845915-n
exemplifies: 06730109-n
similar: https://en-word.net/synset/00362589-a

lightly-r
type: LexicalEntry
canonical form: lightly
sense: 00392845-r
part of speech: adverb

light-r
type: LexicalEntry
canonical form: light
sense: 00392845-r
part of speech: adverb

00392845-r
type: LexicalConcept
in scheme: en-word.net
definition: with few burdens
example: experienced travellers travel light
ili: i20820
lexfile: adv.all
part of speech: adverb

light-colored-a
type: LexicalEntry
canonical form: light-colored
sense: https://en-word.net/lemma/light-colored-a#00409737-a
part of speech: adjective

https://en-word.net/synset/00409737-a
type: LexicalConcept
in scheme: en-word.net
definition: (used of color) having a relatively small amount of coloring agent
example: light blue
example: light colors such as pastels
example: a light-colored powder
ili: i2315
lexfile: adj.all
part of speech: adjective
also: https://en-word.net/synset/00394166-a
attribute: 04986674-n
similar: 00410069-s
similar: 00410218-s
similar: 00410284-s
similar: 00410396-s

00505439-s
type: LexicalConcept
in scheme: en-word.net
definition: (used of soil) loose and large-grained in consistency
example: light soil
ili: i2835
lexfile: adj.all
part of speech: adjective satellite
similar: https://en-word.net/synset/00505233-a

fire-v
type: LexicalEntry
canonical form: fire
sense: 00589392-v
part of speech: verb

ignite-v
type: LexicalEntry
canonical form: ignite
sense: 00589392-v
part of speech: verb
sense: 02765572-v

00589392-v
type: LexicalConcept
in scheme: en-word.net
definition: start or maintain a fire in
example: fire the furnace
lexfile: verb.change
part of speech: verb
hypernym: 00349400-v

wakeful-a
type: LexicalEntry
canonical form: wakeful
sense: 00697019-s
part of speech: adjective

00697019-s
type: LexicalConcept
in scheme: en-word.net
definition: (of sleep) easily disturbed
example: in a light doze
example: a light sleeper
example: a restless wakeful night
ili: i3859
lexfile: adj.all
part of speech: adjective satellite
similar: https://en-word.net/synset/00696805-a

00715651-s
type: LexicalConcept
in scheme: en-word.net
definition: demanding little effort; not burdensome
example: light housework
example: light exercise
ili: i3951
lexfile: adj.all
part of speech: adjective satellite
similar: https://en-word.net/synset/00714994-a

lite-a
type: LexicalEntry
canonical form: lite
sense: 00996467-s
part of speech: adjective

low-cal-a
type: LexicalEntry
canonical form: low-cal
sense: 00996467-s
part of speech: adjective

calorie-free-a
type: LexicalEntry
canonical form: calorie-free
sense: 00996467-s
part of speech: adjective

00996467-s
type: LexicalConcept
in scheme: en-word.net
definition: having relatively few calories
example: light (or lite) beer
example: lite (or light) mayonnaise
example: a low-cal diet
example: cola light
ili: i5435
lexfile: adj.all
part of speech: adjective satellite
similar: https://en-word.net/synset/00996305-a

01185958-s
type: LexicalConcept
in scheme: en-word.net
definition: easily assimilated in the alimentary canal; not rich or heavily seasoned
example: a light diet
ili: i6465
lexfile: adj.all
part of speech: adjective satellite
similar: https://en-word.net/synset/01185568-a

https://en-word.net/synset/01189951-a
type: LexicalConcept
in scheme: en-word.net
definition: of comparatively little physical weight or density
example: a light load
example: magnesium is a light metal — having a specific gravity of 1.74 at 20 degrees C
ili: i6491
lexfile: adj.all
part of speech: adjective
attribute: 05034009-n
similar: 01190276-s
similar: 01190456-s
similar: 01190615-s
similar: 01190865-s
similar: 01191046-s

01191729-s
type: LexicalConcept
in scheme: en-word.net
definition: designed for ease of movement or to carry little weight
example: light aircraft
example: a light truck
ili: i6500
lexfile: adj.all
part of speech: adjective satellite
similar: https://en-word.net/synset/01191601-a

https://en-word.net/synset/01193859-a
type: LexicalConcept
in scheme: en-word.net
definition: psychologically light; especially free from sadness or troubles
example: a light heart
ili: i6510
lexfile: adj.all
part of speech: adjective
similar: 01194027-s

https://en-word.net/synset/01194536-a
type: LexicalConcept
in scheme: en-word.net
definition: not great in degree or quantity or number
example: a light sentence
example: a light accent
example: casualties were light
example: light snow was falling
example: light misty rain
example: light smoke from the chimney
ili: i6514
lexfile: adj.all
part of speech: adjective

https://en-word.net/synset/01194991-a
type: LexicalConcept
in scheme: en-word.net
definition: (physics, chemistry) not having atomic weight greater than average
example: light water is ordinary water
ili: i6516
lexfile: adj.all
part of speech: adjective
domain topic: 06094057-n

https://en-word.net/synset/01195419-a
type: LexicalConcept
in scheme: en-word.net
definition: of little intensity or power or force
example: the light touch of her fingers
example: a light breeze
ili: i6519
lexfile: adj.all
part of speech: adjective
similar: 01195578-s

lightsome-a
type: LexicalEntry
canonical form: lightsome
sense: 01195936-s
part of speech: adjective

tripping-a
type: LexicalEntry
canonical form: tripping
sense: 01195936-s
part of speech: adjective

01195936-s
type: LexicalConcept
in scheme: en-word.net
definition: moving easily and quickly; nimble
example: the dancer was light and graceful
example: a lightsome buoyant step
example: walked with a light tripping step
ili: i6522
lexfile: adj.all
part of speech: adjective satellite
similar: https://en-word.net/synset/01195791-a

https://en-word.net/synset/01196589-a
type: LexicalConcept
in scheme: en-word.net
definition: of the military or industry; using (or being) relatively small or light arms or equipment
example: light infantry
example: light cavalry
example: light industry
example: light weapons
ili: i6525
lexfile: adj.all
part of speech: adjective
similar: 01196818-s

fire up-v
type: LexicalEntry
canonical form: fire up
sense: 01202519-v
part of speech: verb

01202519-v
type: LexicalConcept
in scheme: en-word.net
definition: begin to smoke
example: After the meal, some of the diners lit up
ili: i27622
lexfile: verb.consumption
part of speech: verb
entails: 01200739-v
hypernym: 02765572-v

clean-a
type: LexicalEntry
canonical form: clean
sense: 01912661-s
part of speech: adjective

clear-a
type: LexicalEntry
canonical form: clear
sense: 01912661-s
part of speech: adjective

unclouded-a
type: LexicalEntry
canonical form: unclouded
sense: 01912661-s
part of speech: adjective

01912661-s
type: LexicalConcept
in scheme: en-word.net
definition: (of sound or color) free from anything that dulls or dims
example: efforts to obtain a clean bass in orchestral recordings
example: clear laughter like a waterfall
example: clear reds and blues
example: a light lilting voice like a silver bell
ili: i10451
lexfile: adj.all
part of speech: adjective satellite
similar: https://en-word.net/synset/01911832-a

unhorse-v
type: LexicalEntry
canonical form: unhorse
sense: 01962311-v
part of speech: verb

dismount-v
type: LexicalEntry
canonical form: dismount
sense: 01962311-v
part of speech: verb

get off-v
type: LexicalEntry
canonical form: get off
sense: 01962311-v
part of speech: verb

get down-v
type: LexicalEntry
canonical form: get down
sense: 01962311-v
part of speech: verb

01962311-v
type: LexicalConcept
in scheme: en-word.net
definition: alight from (a horse)
ili: i31519
lexfile: verb.motion
part of speech: verb
domain topic: 00300043-n
hypernym: 01974840-v

alight-v
type: LexicalEntry
canonical form: alight
sense: 01982714-v
part of speech: verb

perch-v
type: LexicalEntry
canonical form: perch
sense: 01982714-v
part of speech: verb

01982714-v
type: LexicalConcept
in scheme: en-word.net
definition: to come to rest, settle
example: Misfortune lighted upon him
ili: i31625
lexfile: verb.motion
part of speech: verb
hypernym: 01983915-v

idle-a
type: LexicalEntry
canonical form: idle
sense: 02128704-s
part of speech: adjective

02128704-s
type: LexicalConcept
in scheme: en-word.net
definition: silly or trivial
example: idle pleasure
example: light banter
example: light idle chatter
ili: i11617
lexfile: adj.all
part of speech: adjective satellite
similar: https://en-word.net/synset/02127738-a

02128852-s
type: LexicalConcept
in scheme: en-word.net
definition: intended primarily as entertainment; not serious or profound
example: light verse
example: a light comedy
ili: i11618
lexfile: adj.all
part of speech: adjective satellite
similar: https://en-word.net/synset/02127738-a

02172875-s
type: LexicalConcept
in scheme: en-word.net
definition: having little importance
example: losing his job was no light matter
ili: i11895
lexfile: adj.all
part of speech: adjective satellite
similar: https://en-word.net/synset/02171958-a

fall-v
type: LexicalEntry
canonical form: fall
sense: 02234610-v
part of speech: verb

02234610-v
type: LexicalConcept
in scheme: en-word.net
definition: fall to somebody by assignment or lot; passed
example: The task fell to me
example: It fell to me to notify the parents of the victims
ili: i32893
lexfile: verb.possession
part of speech: verb
hypernym: 02234332-v
similar: 02234838-v
similar: 02363654-v

unaccented-a
type: LexicalEntry
canonical form: unaccented
sense: 02328120-s
part of speech: adjective

weak-a
type: LexicalEntry
canonical form: weak
sense: 02328120-s
part of speech: adjective

02328120-s
type: LexicalConcept
in scheme: en-word.net
definition: (used of vowels or syllables) pronounced with little or no stress
example: a syllable that ends in a short vowel is a light syllable
example: a weak stress on the second syllable
ili: i12853
lexfile: adj.all
part of speech: adjective satellite
similar: https://en-word.net/synset/02327795-a

scant-a
type: LexicalEntry
canonical form: scant
sense: 02345399-s
part of speech: adjective

short-a
type: LexicalEntry
canonical form: short
sense: 02345399-s
part of speech: adjective

02345399-s
type: LexicalConcept
in scheme: en-word.net
definition: less than the correct or legal or full amount often deliberately so
example: a light pound
example: a scant cup of sugar
example: regularly gives short weight
ili: i12944
lexfile: adj.all
part of speech: adjective satellite
similar: https://en-word.net/synset/02344427-a

abstemious-a
type: LexicalEntry
canonical form: abstemious
sense: 02410587-s
part of speech: adjective

02410587-s
type: LexicalConcept
in scheme: en-word.net
definition: marked by temperance in indulgence
example: abstemious with the use of adverbs
example: a light eater
example: a light smoker
example: ate a light supper
ili: i13295
lexfile: adj.all
part of speech: adjective satellite
similar: https://en-word.net/synset/02410314-a

02422984-s
type: LexicalConcept
in scheme: en-word.net
definition: very thin and insubstantial
example: light summer dresses
ili: i13362
lexfile: adj.all
part of speech: adjective satellite
similar: https://en-word.net/synset/02420960-a

faint-a
type: LexicalEntry
canonical form: faint
sense: 02555295-s
part of speech: adjective

swooning-a
type: LexicalEntry
canonical form: swooning
sense: 02555295-s
part of speech: adjective

light-headed-a
type: LexicalEntry
canonical form: light-headed
sense: 02555295-s
part of speech: adjective

lightheaded-a
type: LexicalEntry
canonical form: lightheaded
sense: 02555295-s
part of speech: adjective

02555295-s
type: LexicalConcept
in scheme: en-word.net
definition: weak and likely to lose consciousness
example: suddenly felt faint from the pain
example: was sick and faint from hunger
example: felt light in the head
example: a swooning fit
example: light-headed with wine
example: light-headed from lack of sleep
ili: i14115
lexfile: adj.all
part of speech: adjective satellite
similar: https://en-word.net/synset/02552072-a

02765572-v
type: LexicalConcept
in scheme: en-word.net
definition: cause to start burning; subject to fire or great heat
example: Great heat can ignite almost any dry matter
example: Light a cigarette
ili: i35480
lexfile: verb.weather
part of speech: verb
causes: 00377673-v
hypernym: 02768426-v

light-n
type: LexicalEntry
canonical form: light
sense: 03670692-n
part of speech: noun
sense: 03671917-n
sense: 04958550-n
sense: 04960557-n
sense: 05025269-n
sense: 05620489-n
sense: 05815941-n
sense: 06220526-n
sense: 06887069-n
sense: 08663763-n
sense: 10296356-n
sense: 11494354-n
sense: 14006789-n
sense: 14587365-n

light source-n
type: LexicalEntry
canonical form: light source
sense: 03670692-n
part of speech: noun

03670692-n
type: LexicalConcept
in scheme: en-word.net
definition: any device serving as a source of illumination
example: he stopped the car and turned off the lights
ili: i55679
lexfile: noun.artifact
part of speech: noun
hypernym: 04270870-n

lighter-n
type: LexicalEntry
canonical form: lighter
sense: 03671917-n
part of speech: noun

igniter-n
type: LexicalEntry
canonical form: igniter
sense: 03671917-n
part of speech: noun

ignitor-n
type: LexicalEntry
canonical form: ignitor
sense: 03671917-n
part of speech: noun

03671917-n
type: LexicalConcept
in scheme: en-word.net
definition: a device for lighting or igniting fuel or charges or fires
example: do you have a light?
ili: i55684
lexfile: noun.artifact
part of speech: noun
hypernym: 03187746-n

lightness-n
type: LexicalEntry
canonical form: lightness
sense: 04958550-n
part of speech: noun

04958550-n
type: LexicalConcept
in scheme: en-word.net
definition: the visual effect of illumination on objects or scenes as created in pictures
example: he could paint the lightest light and the darkest dark
ili: i63000
lexfile: noun.attribute
part of speech: noun
attribute: https://en-word.net/synset/00270855-a
attribute: https://en-word.net/synset/00273948-a
hypernym: 04957303-n

sparkle-n
type: LexicalEntry
canonical form: sparkle
sense: 04960557-n
part of speech: noun

twinkle-n
type: LexicalEntry
canonical form: twinkle
sense: 04960557-n
part of speech: noun

spark-n
type: LexicalEntry
canonical form: spark
sense: 04960557-n
part of speech: noun

04960557-n
type: LexicalConcept
in scheme: en-word.net
definition: merriment expressed by a brightness or gleam or animation of countenance
example: he had a sparkle in his eye
example: there's a perpetual twinkle in his eyes
ili: i63011
lexfile: noun.attribute
part of speech: noun
hypernym: 04640810-n
hypernym: 04687095-n

luminosity-n
type: LexicalEntry
canonical form: luminosity
sense: 05025269-n
part of speech: noun

brightness-n
type: LexicalEntry
canonical form: brightness
sense: 05025269-n
part of speech: noun

brightness level-n
type: LexicalEntry
canonical form: brightness level
sense: 05025269-n
part of speech: noun

luminance-n
type: LexicalEntry
canonical form: luminance
sense: 05025269-n
part of speech: noun

luminousness-n
type: LexicalEntry
canonical form: luminousness
sense: 05025269-n
part of speech: noun

05025269-n
type: LexicalConcept
in scheme: en-word.net
definition: the quality of being luminous; emitting or reflecting light
example: its luminosity is measured relative to that of our sun
ili: i63372
lexfile: noun.attribute
part of speech: noun
attribute: https://en-word.net/synset/00279417-a
attribute: https://en-word.net/synset/00284569-a
hypernym: 05016354-n

05620489-n
type: LexicalConcept
in scheme: en-word.net
definition: public awareness
example: it brought the scandal to light
ili: i66404
lexfile: noun.cognition
part of speech: noun
hypernym: 05619850-n

05815941-n
type: LexicalConcept
in scheme: en-word.net
definition: mental understanding as an enlightening experience
example: he finally saw the light
example: can you shed light on this problem?
ili: i67402
lexfile: noun.cognition
part of speech: noun
hypernym: 05815314-n

06220526-n
type: LexicalConcept
in scheme: en-word.net
definition: a particular perspective or aspect of a situation
example: although he saw it in a different light, he still did not understand
ili: i69169
lexfile: noun.cognition
part of speech: noun
hypernym: 06218486-n

06887069-n
type: LexicalConcept
in scheme: en-word.net
definition: a visual warning signal
example: they saw the light of the beacon
example: there was a light at every corner
ili: i72616
lexfile: noun.communication
part of speech: noun
hypernym: 06886621-n

08663763-n
type: LexicalConcept
in scheme: en-word.net
definition: an illuminated area
example: he stepped into the light
ili: i82401
lexfile: noun.location
part of speech: noun
hypernym: 08663538-n

10296356-n
type: LexicalConcept
in scheme: en-word.net
definition: a person regarded very fondly
example: the light of my life
ili: i91112
lexfile: noun.person
part of speech: noun
hypernym: 10132360-n

visible light-n
type: LexicalEntry
canonical form: visible light
sense: 11494354-n
part of speech: noun

visible radiation-n
type: LexicalEntry
canonical form: visible radiation
sense: 11494354-n
part of speech: noun

11494354-n
type: LexicalConcept
in scheme: en-word.net
definition: (physics) electromagnetic radiation that can produce a visual sensation
example: the light was filtered through a soft glass window
ili: i97892
lexfile: noun.phenomenon
part of speech: noun
domain topic: 06100457-n
hypernym: 11441515-n

lighting-n
type: LexicalEntry
canonical form: lighting
sense: 14006789-n
part of speech: noun

14006789-n
type: LexicalConcept
in scheme: en-word.net
definition: having abundant light or illumination
example: they played as long as it was light
example: as long as the lighting was good
ili: i110420
lexfile: noun.state
part of speech: noun
hypernym: 14006632-n

illumination-n
type: LexicalEntry
canonical form: illumination
sense: 14587365-n
part of speech: noun

14587365-n
type: LexicalConcept
in scheme: en-word.net
definition: a condition of spiritual awareness; divine illumination
example: follow God's light
ili: i113545
lexfile: noun.state
part of speech: noun
hypernym: 13943868-n