left-n
type: LexicalEntry
canonical form: left
sense: 08433285-n
part of speech: noun

left wing-n
type: LexicalEntry
canonical form: left wing
sense: 08433285-n
part of speech: noun

08433285-n
type: LexicalConcept
in scheme: en-word.net
definition: those who support varying degrees of social or political or economic change designed to promote the public welfare
ili: i81340
lexfile: noun.group
part of speech: noun
hypernym: 08268798-n