left-n
type: LexicalEntry
canonical form: left
sense: 05573181-n
part of speech: noun

left hand-n
type: LexicalEntry
canonical form: left hand
sense: 05573181-n
part of speech: noun

05573181-n
type: LexicalConcept
in scheme: en-word.net
definition: the hand that is on the left side of the body
example: jab with your left
ili: i66157
lexfile: noun.body
part of speech: noun
hypernym: 05572223-n