left field-n
type: LexicalEntry
canonical form: left field
sense: 00725684-n
part of speech: noun
sense: 03659700-n

leftfield-n
type: LexicalEntry
canonical form: leftfield
sense: 00725684-n
part of speech: noun
sense: 03659700-n

00725684-n
type: LexicalConcept
in scheme: en-word.net
definition: the fielding position of the player on a baseball team who is expected to field balls in the left third of the outfield (looking from home plate)
ili: i39237
lexfile: noun.act
part of speech: noun
hypernym: 00723730-n

left-n
type: LexicalEntry
canonical form: left
sense: 03659700-n
part of speech: noun

03659700-n
type: LexicalConcept
in scheme: en-word.net
definition: the piece of ground in the outfield on the catcher's left
example: the batter flied out to left
ili: i55615
lexfile: noun.artifact
part of speech: noun
hypernym: 08691133-n